Reaction Details
TargetProprotein convertase subtilisin/kexin type 9
LigandBDBM200333
Substrate/Competitorn/a
Meas. Tech.Cell Free Assay
IC50 3050±n/a nM
Citation Darout, EDullea, RHawkins, JJLondregan, ATLoria, PMMaguire, BMcClure, KFPetersen, DNPiotrowski, DW Substituted amide compounds US Patent US9227956 Publication Date 1/5/2016
 
Proprotein convertase subtilisin/kexin type 9
Name:Proprotein convertase subtilisin/kexin type 9
Type:Enzyme
Mol. Mass.:74286.93
Organism:Homo sapiens (Human)
Description:Q8NBP7
Residue:692
BDBM200333
NameBDBM200333
Synonyms:US9227956, 17
TypeSmall organic molecule
Emp. Form.C23H25N9O
Mol. Mass.443.5043
SMILESCc1cccnc1N([C@@H]1CCCNC1)C(=O)c1ccc(cc1)-c1cnn(C)c1-c1nn[nH]n1