Reaction Details
TargetProprotein convertase subtilisin/kexin type 9
LigandBDBM200348
Substrate/Competitorn/a
Meas. Tech.Cell Free Assay
IC50 7260±n/a nM
Citation Darout, EDullea, RHawkins, JJLondregan, ATLoria, PMMaguire, BMcClure, KFPetersen, DNPiotrowski, DW Substituted amide compounds US Patent US9227956 Publication Date 1/5/2016
 
Proprotein convertase subtilisin/kexin type 9
Name:Proprotein convertase subtilisin/kexin type 9
Type:Enzyme
Mol. Mass.:74286.93
Organism:Homo sapiens (Human)
Description:Q8NBP7
Residue:692
BDBM200348
NameBDBM200348
Synonyms:US9227956, 32 | US9227956, 33
TypeSmall organic molecule
Emp. Form.C29H35N9O4
Mol. Mass.573.6461
SMILESCCOC(=O)OC(CC)n1nnc(n1)-c1c(cnn1C)-c1ccc(cc1)C(=O)N([C@@H]1CCCNC1)c1ncccc1C