Reaction Details
Target6-phosphofructo-2-kinase/fructose-2,6-bisphosphatase 3
LigandBDBM200914
Substrate/Competitorn/a
Meas. Tech.Kinase Assay (Method A)
IC50 80±n/a nM
Citation Bystrom, SHedgecock, CHoman, ELundback, TMartinsson, JSari, MFarnegardh, KJonsson, M Sulfonamide compounds US Patent US9233946 Publication Date 1/12/2016
 
6-phosphofructo-2-kinase/fructose-2,6-bisphosphatase 3
Name:6-phosphofructo-2-kinase/fructose-2,6-bisphosphatase 3
Type:Enzyme
Mol. Mass.:59620.59
Organism:Homo sapiens (Human)
Description:Q16875
Residue:520
BDBM200914
NameBDBM200914
Synonyms:US9233946, 13
TypeSmall organic molecule
Emp. Form.C19H19N5O3S
Mol. Mass.397.451
SMILESCC(C)c1ccc2oc(c(C)c2c1)S(=O)(=O)Nc1cccc(c1)-c1nnn[nH]1