Reaction Details
TargetSodium- and chloride-dependent glycine transporter 1
LigandBDBM201040
Substrate/Competitorn/a
Meas. Tech.Cytostar-T Assay
IC50 4±n/a nM
Citation Hoenke, CGiovannini, RLessel, URosenbrock, HSchmid, B Derivatives of 4-(piperazinylcarbonyl)thiane-1, 1-dione which inhibit GlyT1 US Patent US9233953 Publication Date 1/12/2016
 
Sodium- and chloride-dependent glycine transporter 1
Name:Sodium- and chloride-dependent glycine transporter 1
Type:Enzyme
Mol. Mass.:78270.54
Organism:Homo sapiens (Human)
Description:P48067
Residue:706
BDBM201040
NameBDBM201040
Synonyms:US9233953, 1
TypeSmall organic molecule
Emp. Form.C21H21F5N4O3S
Mol. Mass.504.473
SMILESFc1cccc(C2CN(CCN2C(=O)C2CCS(=O)(=O)CC2)c2ncc(cn2)C(F)(F)F)c1F