Reaction Details
TargetSodium- and chloride-dependent glycine transporter 1
LigandBDBM201060
Substrate/Competitorn/a
Meas. Tech.Cytostar-T Assay
IC50 5±n/a nM
Citation Hoenke, CGiovannini, RLessel, URosenbrock, HSchmid, B Derivatives of 4-(piperazinylcarbonyl)thiane-1, 1-dione which inhibit GlyT1 US Patent US9233953 Publication Date 1/12/2016
 
Sodium- and chloride-dependent glycine transporter 1
Name:Sodium- and chloride-dependent glycine transporter 1
Type:Enzyme
Mol. Mass.:78270.54
Organism:Homo sapiens (Human)
Description:P48067
Residue:706
BDBM201060
NameBDBM201060
Synonyms:US9233953, 21
TypeSmall organic molecule
Emp. Form.C22H22F5N3O3S
Mol. Mass.503.485
SMILESFc1cccc(C2CN(CCN2C(=O)C2CCS(=O)(=O)CC2)c2ccc(cn2)C(F)(F)F)c1F