Reaction Details
TargetSodium- and chloride-dependent glycine transporter 1
LigandBDBM201115
Substrate/Competitorn/a
Meas. Tech.Cytostar-T Assay
IC50 3±n/a nM
Citation Hoenke, CGiovannini, RLessel, URosenbrock, HSchmid, B Derivatives of 4-(piperazinylcarbonyl)thiane-1, 1-dione which inhibit GlyT1 US Patent US9233953 Publication Date 1/12/2016
 
Sodium- and chloride-dependent glycine transporter 1
Name:Sodium- and chloride-dependent glycine transporter 1
Type:Enzyme
Mol. Mass.:78270.54
Organism:Homo sapiens (Human)
Description:P48067
Residue:706
BDBM201115
NameBDBM201115
Synonyms:US9233953, 76
TypeSmall organic molecule
Emp. Form.C20H21F4N3O4S
Mol. Mass.475.457
SMILESFc1ccccc1C1CN(CCN1C(=O)C1CCS(=O)(=O)CC1)c1cc(on1)C(F)(F)F