Reaction Details
TargetSodium- and chloride-dependent glycine transporter 1
LigandBDBM201118
Substrate/Competitorn/a
Meas. Tech.Cytostar-T Assay
IC50 6±n/a nM
Citation Hoenke, CGiovannini, RLessel, URosenbrock, HSchmid, B Derivatives of 4-(piperazinylcarbonyl)thiane-1, 1-dione which inhibit GlyT1 US Patent US9233953 Publication Date 1/12/2016
 
Sodium- and chloride-dependent glycine transporter 1
Name:Sodium- and chloride-dependent glycine transporter 1
Type:Enzyme
Mol. Mass.:78270.54
Organism:Homo sapiens (Human)
Description:P48067
Residue:706
BDBM201118
NameBDBM201118
Synonyms:US9233953, 79
TypeSmall organic molecule
Emp. Form.C18H19ClF3N3O4S2
Mol. Mass.497.939
SMILESFC(F)(F)c1cc(no1)N1CCN(C(C1)c1ccc(Cl)s1)C(=O)C1CCS(=O)(=O)CC1