Reaction Details
TargetSodium- and chloride-dependent glycine transporter 1
LigandBDBM201131
Substrate/Competitorn/a
Meas. Tech.Cytostar-T Assay
IC50 9±n/a nM
Citation Hoenke, CGiovannini, RLessel, URosenbrock, HSchmid, B Derivatives of 4-(piperazinylcarbonyl)thiane-1, 1-dione which inhibit GlyT1 US Patent US9233953 Publication Date 1/12/2016
 
Sodium- and chloride-dependent glycine transporter 1
Name:Sodium- and chloride-dependent glycine transporter 1
Type:Enzyme
Mol. Mass.:78270.54
Organism:Homo sapiens (Human)
Description:P48067
Residue:706
BDBM201131
NameBDBM201131
Synonyms:US9233953, 92
TypeSmall organic molecule
Emp. Form.C19H23ClN4O3S2
Mol. Mass.454.994
SMILESCc1cnc(nc1)N1CCN(C(C1)c1ccc(Cl)s1)C(=O)C1CCS(=O)(=O)CC1