Reaction Details
TargetSodium- and chloride-dependent glycine transporter 1
LigandBDBM201153
Substrate/Competitorn/a
Meas. Tech.Cytostar-T Assay
IC50 10±n/a nM
Citation Hoenke, CGiovannini, RLessel, URosenbrock, HSchmid, B Derivatives of 4-(piperazinylcarbonyl)thiane-1, 1-dione which inhibit GlyT1 US Patent US9233953 Publication Date 1/12/2016
 
Sodium- and chloride-dependent glycine transporter 1
Name:Sodium- and chloride-dependent glycine transporter 1
Type:Enzyme
Mol. Mass.:78270.54
Organism:Homo sapiens (Human)
Description:P48067
Residue:706
BDBM201153
NameBDBM201153
Synonyms:US9233953, 114
TypeSmall organic molecule
Emp. Form.C19H21F3N4O4S
Mol. Mass.458.455
SMILESFC(F)c1nc(no1)N1CCN(C(C1)c1ccc(F)cc1)C(=O)C1CCS(=O)(=O)CC1