Reaction Details
TargetAlpha-1,6-mannosyl-glycoprotein 2-beta-N-acetylglucosaminyltransferase
LigandBDBM201529
Substrate/Competitorn/a
Meas. Tech.MGAT LCMS Assay
pH7.4±n/a
IC50 2±n/a nM
Commentsextracted
Citation Turdi, HHangeland, JJLawrence, RMCheng, DAhmad, SMeng, WBrigance, RPDevasthale, PZhao, G Aryl dihydropyridinones and piperidinone MGAT2 inhibitors US Patent US9187424 Publication Date 11/17/2015
 
Alpha-1,6-mannosyl-glycoprotein 2-beta-N-acetylglucosaminyltransferase
Name:Alpha-1,6-mannosyl-glycoprotein 2-beta-N-acetylglucosaminyltransferase
Type:n/a
Mol. Mass.:51567.80
Organism:Homo sapiens (Human)
Description:Q10469
Residue:447
BDBM201529
NameBDBM201529
Synonyms:US9187424, 296
TypeSmall organic molecule
Emp. Form.C31H27F7N2O4
Mol. Mass.624.5459
SMILESCOc1ccc(NC(=O)C2=C(CC(NC2=O)(c2ccc(OCCCC(F)(F)F)cc2)C(F)(F)F)c2ccc(C)cc2F)cc1