Reaction Details
TargetMitogen-activated protein kinase 1
LigandBDBM201669
Substrate/Competitorn/a
Meas. Tech.IMAP-FP Assay
IC50 0.2±n/a nM
Citation Wilson, KJWitter, DJSiliphaivanh, PLipford, KSloman, DFalcone, DO'Boyle, BMansoor, UFLim, JMethot, JLBoyce, CChen, LDaniels, MHFevrier, SHuang, XKurukulasuriya, RTong, LZhou, WKozlowski, JMaletic, MMShinkre, BAThatai, JTBakshi, RKKarunakaran, GB Compounds that are ERK inhibitors US Patent US9233979 Publication Date 1/12/2016
 
Mitogen-activated protein kinase 1
Name:Mitogen-activated protein kinase 1
Type:Ser/Thr Protein Kinase
Mol. Mass.:41392.76
Organism:Homo sapiens (Human)
Description:P28482
Residue:360
BDBM201669
NameBDBM201669
Synonyms:US9233979, 97
TypeSmall organic molecule
Emp. Form.C20H23FN6O3
Mol. Mass.414.4334
SMILESC[C@@H](O)[C@@H](NC(=O)Nc1cc2[nH]nc(N3CCOCC3)c2cn1)c1ccc(F)cc1