Reaction Details
TargetTyrosine-protein kinase BTK
LigandBDBM202091
Substrate/Competitorn/a
Meas. Tech.Recombinant Human BTK Inhibition Assay
IC50 2±n/a nM
Citation Thakkar, MKoul, SBhuniya, DMookhtiar, KKurhade, SMunot, YMengawade, TKulkarni, BA Substituted hetero-bicyclic compounds, compositions and medicinal applications thereof US Patent US9233983 Publication Date 1/12/2016
 
Tyrosine-protein kinase BTK
Name:Tyrosine-protein kinase BTK
Type:Enzyme
Mol. Mass.:76289.95
Organism:Homo sapiens (Human)
Description:Q06187
Residue:659
BDBM202091
NameBDBM202091
Synonyms:US9233983, B-10
TypeSmall organic molecule
Emp. Form.C36H35N7O2
Mol. Mass.597.7088
SMILESCN1CCN(Cc2ccc(cc2)-c2cc3c(ncnc3[nH]2)-c2cccc(c2CO)-n2ncc3cc(ccc3c2=O)C2CC2)CC1