Reaction Details
TargetTyrosine-protein kinase BTK
LigandBDBM202112
Substrate/Competitorn/a
Meas. Tech.Recombinant Human BTK Inhibition Assay
IC50 3±n/a nM
Citation Thakkar, MKoul, SBhuniya, DMookhtiar, KKurhade, SMunot, YMengawade, TKulkarni, BA Substituted hetero-bicyclic compounds, compositions and medicinal applications thereof US Patent US9233983 Publication Date 1/12/2016
 
Tyrosine-protein kinase BTK
Name:Tyrosine-protein kinase BTK
Type:Enzyme
Mol. Mass.:76289.95
Organism:Homo sapiens (Human)
Description:Q06187
Residue:659
BDBM202112
NameBDBM202112
Synonyms:US9233983, D-4
TypeSmall organic molecule
Emp. Form.C37H35N5O2
Mol. Mass.581.7061
SMILESCN1CCC(CC1)c1ccc(cc1)-c1cc2c(ncnc2[nH]1)-c1cccc(c1CO)-n1ccc2cc(ccc2c1=O)C1CC1