Reaction Details
TargetTyrosine-protein kinase BTK
LigandBDBM202122
Substrate/Competitorn/a
Meas. Tech.Recombinant Human BTK Inhibition Assay
IC50 1.7±n/a nM
Citation Thakkar, MKoul, SBhuniya, DMookhtiar, KKurhade, SMunot, YMengawade, TKulkarni, BA Substituted hetero-bicyclic compounds, compositions and medicinal applications thereof US Patent US9233983 Publication Date 1/12/2016
 
Tyrosine-protein kinase BTK
Name:Tyrosine-protein kinase BTK
Type:Enzyme
Mol. Mass.:76289.95
Organism:Homo sapiens (Human)
Description:Q06187
Residue:659
BDBM202122
NameBDBM202122
Synonyms:US9233983, D-14
TypeSmall organic molecule
Emp. Form.C37H37FN6O4
Mol. Mass.648.7259
SMILESOCc1c(cccc1-c1ccnc2[nH]c(cc12)-c1cnn(c1)C1CCN(CC1)C1COC1)N1CCOc2cc(cc(F)c2C1=O)C1CC1