Reaction Details
TargetTyrosine-protein kinase BTK
LigandBDBM202142
Substrate/Competitorn/a
Meas. Tech.Recombinant Human BTK Inhibition Assay
IC50 2±n/a nM
Citation Thakkar, MKoul, SBhuniya, DMookhtiar, KKurhade, SMunot, YMengawade, TKulkarni, BA Substituted hetero-bicyclic compounds, compositions and medicinal applications thereof US Patent US9233983 Publication Date 1/12/2016
 
Tyrosine-protein kinase BTK
Name:Tyrosine-protein kinase BTK
Type:Enzyme
Mol. Mass.:76289.95
Organism:Homo sapiens (Human)
Description:Q06187
Residue:659
BDBM202142
NameBDBM202142
Synonyms:US9233983, I-13
TypeSmall organic molecule
Emp. Form.C39H39FN6O4
Mol. Mass.674.7632
SMILESOCc1c(cccc1-c1ccnc2[nH]c(cc12)-c1ccc(CN2CCN(CC2)C2COC2)cn1)N1CCOc2cc(cc(F)c2C1=O)C1CC1