Reaction Details
TargetTyrosine-protein kinase BTK
LigandBDBM202150
Substrate/Competitorn/a
Meas. Tech.Recombinant Human BTK Inhibition Assay
IC50 0.55±n/a nM
Citation Thakkar, MKoul, SBhuniya, DMookhtiar, KKurhade, SMunot, YMengawade, TKulkarni, BA Substituted hetero-bicyclic compounds, compositions and medicinal applications thereof US Patent US9233983 Publication Date 1/12/2016
 
Tyrosine-protein kinase BTK
Name:Tyrosine-protein kinase BTK
Type:Enzyme
Mol. Mass.:76289.95
Organism:Homo sapiens (Human)
Description:Q06187
Residue:659
BDBM202150
NameBDBM202150
Synonyms:US9233983, I-20
TypeSmall organic molecule
Emp. Form.C36H33F2N5O4
Mol. Mass.637.6751
SMILESOCc1c(cc(F)cc1-c1ccnc2[nH]c(cc12)-c1ccc(CN2CCOCC2)cn1)N1CCOc2cc(cc(F)c2C1=O)C1CC1