Reaction Details
TargetTyrosine-protein kinase BTK
LigandBDBM202202
Substrate/Competitorn/a
Meas. Tech.Recombinant Human BTK Inhibition Assay
IC50 2.5±n/a nM
Citation Thakkar, MKoul, SBhuniya, DMookhtiar, KKurhade, SMunot, YMengawade, TKulkarni, BA Substituted hetero-bicyclic compounds, compositions and medicinal applications thereof US Patent US9233983 Publication Date 1/12/2016
 
Tyrosine-protein kinase BTK
Name:Tyrosine-protein kinase BTK
Type:Enzyme
Mol. Mass.:76289.95
Organism:Homo sapiens (Human)
Description:Q06187
Residue:659
BDBM202202
NameBDBM202202
Synonyms:US9233983, P-17
TypeSmall organic molecule
Emp. Form.C34H33FN4O4
Mol. Mass.580.6486
SMILESOCc1c(cc(F)cc1-c1ccnc2[nH]c(cc12)C1=CCN(CC1)C1COC1)N1CCOc2cc(ccc2C1=O)C1CC1