Reaction Details
TargetTyrosine-protein kinase BTK
LigandBDBM202203
Substrate/Competitorn/a
Meas. Tech.Recombinant Human BTK Inhibition Assay
IC50 1.7±n/a nM
Citation Thakkar, MKoul, SBhuniya, DMookhtiar, KKurhade, SMunot, YMengawade, TKulkarni, BA Substituted hetero-bicyclic compounds, compositions and medicinal applications thereof US Patent US9233983 Publication Date 1/12/2016
 
Tyrosine-protein kinase BTK
Name:Tyrosine-protein kinase BTK
Type:Enzyme
Mol. Mass.:76289.95
Organism:Homo sapiens (Human)
Description:Q06187
Residue:659
BDBM202203
NameBDBM202203
Synonyms:US9233983, P-18
TypeSmall organic molecule
Emp. Form.C36H36FN5O5
Mol. Mass.637.6999
SMILESOCc1c(cccc1-c1ccnc2[nH]c(cc12)C1=CCN(CC1)C(=O)N1CCOCC1)N1CCOc2cc(cc(F)c2C1=O)C1CC1