Reaction Details
TargetTyrosine-protein kinase BTK
LigandBDBM202208
Substrate/Competitorn/a
Meas. Tech.Recombinant Human BTK Inhibition Assay
IC50 1.4±n/a nM
Citation Thakkar, MKoul, SBhuniya, DMookhtiar, KKurhade, SMunot, YMengawade, TKulkarni, BA Substituted hetero-bicyclic compounds, compositions and medicinal applications thereof US Patent US9233983 Publication Date 1/12/2016
 
Tyrosine-protein kinase BTK
Name:Tyrosine-protein kinase BTK
Type:Enzyme
Mol. Mass.:76289.95
Organism:Homo sapiens (Human)
Description:Q06187
Residue:659
BDBM202208
NameBDBM202208
Synonyms:US9233983, P-23
TypeSmall organic molecule
Emp. Form.C35H37FN4O4
Mol. Mass.596.6911
SMILESCC(C)(O)CN1CCC(=CC1)c1cc2c(ccnc2[nH]1)-c1cccc(N2CCOc3cc(cc(F)c3C2=O)C2CC2)c1CO