Reaction Details
TargetTyrosine-protein kinase BTK
LigandBDBM202220
Substrate/Competitorn/a
Meas. Tech.Recombinant Human BTK Inhibition Assay
IC50 1.15±n/a nM
Citation Thakkar, MKoul, SBhuniya, DMookhtiar, KKurhade, SMunot, YMengawade, TKulkarni, BA Substituted hetero-bicyclic compounds, compositions and medicinal applications thereof US Patent US9233983 Publication Date 1/12/2016
 
Tyrosine-protein kinase BTK
Name:Tyrosine-protein kinase BTK
Type:Enzyme
Mol. Mass.:76289.95
Organism:Homo sapiens (Human)
Description:Q06187
Residue:659
BDBM202220
NameBDBM202220
Synonyms:US9233983, Q-3
TypeSmall organic molecule
Emp. Form.C39H37F2N5O5
Mol. Mass.693.7384
SMILESOCc1c(cc(F)cc1-c1ccnc2[nH]c(cc12)-c1ccc(OC2CCN(CC2)C2COC2)cn1)N1CCOc2cc(cc(F)c2C1=O)C1CC1