Reaction Details
TargetSodium- and chloride-dependent glycine transporter 1
LigandBDBM202238
Substrate/Competitorn/a
Meas. Tech.Radioligand Binding Assay
Ki<0.1±n/a nM
Citation Pohlki, FLange, UAmberg, WOchse, MBehl, BHornberger, WMezler, MHutchins, CWTurner, S Phenalkylamine derivatives, pharmaceutical compositions containing them, and their use in therapy US Patent US9238619 Publication Date 1/19/2016
 
Sodium- and chloride-dependent glycine transporter 1
Name:Sodium- and chloride-dependent glycine transporter 1
Type:Enzyme
Mol. Mass.:78270.54
Organism:Homo sapiens (Human)
Description:P48067
Residue:706
BDBM202238
NameBDBM202238
Synonyms:US9238619, 3
TypeSmall organic molecule
Emp. Form.C21H25FN4O3S
Mol. Mass.432.512
SMILESCn1cc(cn1)S(=O)(=O)NCCOc1cc(ccc1F)C(CN)Cc1ccccc1