Reaction Details
TargetSodium- and chloride-dependent glycine transporter 1
LigandBDBM202265
Substrate/Competitorn/a
Meas. Tech.Radioligand Binding Assay
Ki<0.1±n/a nM
Citation Pohlki, FLange, UAmberg, WOchse, MBehl, BHornberger, WMezler, MHutchins, CWTurner, S Phenalkylamine derivatives, pharmaceutical compositions containing them, and their use in therapy US Patent US9238619 Publication Date 1/19/2016
 
Sodium- and chloride-dependent glycine transporter 1
Name:Sodium- and chloride-dependent glycine transporter 1
Type:Enzyme
Mol. Mass.:78270.54
Organism:Homo sapiens (Human)
Description:P48067
Residue:706
BDBM202265
NameBDBM202265
Synonyms:US9238619, 23
TypeSmall organic molecule
Emp. Form.C23H29FN4O3S
Mol. Mass.460.565
SMILESCN(C)CC(Cc1ccccc1)c1cc(OCCNS(=O)(=O)c2cn(C)cn2)ccc1F