Reaction Details
TargetSodium- and chloride-dependent glycine transporter 1
LigandBDBM202322
Substrate/Competitorn/a
Meas. Tech.Radioligand Binding Assay
Ki<1±n/a nM
Citation Pohlki, FLange, UAmberg, WOchse, MBehl, BHornberger, WMezler, MHutchins, CWTurner, S Phenalkylamine derivatives, pharmaceutical compositions containing them, and their use in therapy US Patent US9238619 Publication Date 1/19/2016
 
Sodium- and chloride-dependent glycine transporter 1
Name:Sodium- and chloride-dependent glycine transporter 1
Type:Enzyme
Mol. Mass.:78270.54
Organism:Homo sapiens (Human)
Description:P48067
Residue:706
BDBM202322
NameBDBM202322
Synonyms:US9238619, 53
TypeSmall organic molecule
Emp. Form.C24H29FN4O3S
Mol. Mass.472.575
SMILESCN(CCOc1cc(ccc1F)C1(Cc2ccccc2)CN(C)C1)S(=O)(=O)c1cn(C)cn1