Reaction Details
TargetSodium- and chloride-dependent glycine transporter 1
LigandBDBM202328
Substrate/Competitorn/a
Meas. Tech.Radioligand Binding Assay
Ki<1±n/a nM
Citation Pohlki, FLange, UAmberg, WOchse, MBehl, BHornberger, WMezler, MHutchins, CWTurner, S Phenalkylamine derivatives, pharmaceutical compositions containing them, and their use in therapy US Patent US9238619 Publication Date 1/19/2016
 
Sodium- and chloride-dependent glycine transporter 1
Name:Sodium- and chloride-dependent glycine transporter 1
Type:Enzyme
Mol. Mass.:78270.54
Organism:Homo sapiens (Human)
Description:P48067
Residue:706
BDBM202328
NameBDBM202328
Synonyms:US9238619, 56
TypeSmall organic molecule
Emp. Form.C23H26N4O4S
Mol. Mass.454.542
SMILESCn1cnc(c1)S(=O)(=O)NCCOc1cccc(c1)C1(Cc2ccccc2)CNC(=O)C1