Reaction Details
TargetSodium- and chloride-dependent glycine transporter 1
LigandBDBM202353
Substrate/Competitorn/a
Meas. Tech.Radioligand Binding Assay
Ki<0.1±n/a nM
Citation Pohlki, FLange, UAmberg, WOchse, MBehl, BHornberger, WMezler, MHutchins, CWTurner, S Phenalkylamine derivatives, pharmaceutical compositions containing them, and their use in therapy US Patent US9238619 Publication Date 1/19/2016
 
Sodium- and chloride-dependent glycine transporter 1
Name:Sodium- and chloride-dependent glycine transporter 1
Type:Enzyme
Mol. Mass.:78270.54
Organism:Homo sapiens (Human)
Description:P48067
Residue:706
BDBM202353
NameBDBM202353
Synonyms:US9238619, 72
TypeSmall organic molecule
Emp. Form.C24H29FN4O3S
Mol. Mass.472.575
SMILESCn1cnc(c1)S(=O)(=O)NCCOc1cccc(c1)C1(Cc2ccccc2)CN(CCF)C1