Reaction Details
TargetSerine/threonine-protein kinase/endoribonuclease IRE1
LigandBDBM111368
Substrate/Competitorn/a
Meas. Tech.In Vitro Enzyme Assay
pH7.5±n/a
IC50 3±n/a nM
Commentsextracted
Citation Patterson, JBLonergan, DGFlynn, GAZeng, QPallai, PV IRE-1α inhibitors US Patent US9241942 Publication Date 1/26/2016
 
Serine/threonine-protein kinase/endoribonuclease IRE1
Name:Serine/threonine-protein kinase/endoribonuclease IRE1
Type:Enzyme
Mol. Mass.:109731.20
Organism:Homo sapiens (Human)
Description:O75460
Residue:977
BDBM111368
NameBDBM111368
Synonyms:US8614253, 32-4 US9493435, 168
TypeSmall organic molecule
Emp. Form.C21H19NO3
Mol. Mass.333.3805
SMILESCC(C)NC(=O)c1cccc(c1)-c1ccc2c(C=O)c(O)ccc2c1