Reaction Details
TargetSerine/threonine-protein kinase/endoribonuclease IRE1
LigandBDBM111358
Substrate/Competitorn/a
Meas. Tech.Cell-Based Assay
EC50 1000±n/a nM
Citation Patterson, JBLonergan, DGFlynn, GAZeng, QPallai, PV IRE-1α inhibitors US Patent US9241942 Publication Date 1/26/2016
 
Serine/threonine-protein kinase/endoribonuclease IRE1
Name:Serine/threonine-protein kinase/endoribonuclease IRE1
Type:Enzyme
Mol. Mass.:109731.20
Organism:Homo sapiens (Human)
Description:O75460
Residue:977
BDBM111358
NameBDBM111358
Synonyms:US8614253, 29-18 | US9241942, 29-18
TypeSmall organic molecule
Emp. Form.C18H13NO3
Mol. Mass.291.3007
SMILESNC(=O)c1cccc(c1)-c1ccc2c(C=O)c(O)ccc2c1