Reaction Details
TargetSerine/threonine-protein kinase/endoribonuclease IRE1
LigandBDBM111384
Substrate/Competitorn/a
Meas. Tech.Cell-Based Assay
EC50 10000±n/a nM
Citation Patterson, JBLonergan, DGFlynn, GAZeng, QPallai, PV IRE-1α inhibitors US Patent US9241942 Publication Date 1/26/2016
 
Serine/threonine-protein kinase/endoribonuclease IRE1
Name:Serine/threonine-protein kinase/endoribonuclease IRE1
Type:Enzyme
Mol. Mass.:109731.20
Organism:Homo sapiens (Human)
Description:O75460
Residue:977
BDBM111384
NameBDBM111384
Synonyms:US8614253, 34-3 | US9241942, 34-3
TypeSmall organic molecule
Emp. Form.C10H7NO2
Mol. Mass.173.1681
SMILESOc1ccc2cccnc2c1C=O