Reaction Details
TargetPotassium channel subfamily K member 2
LigandBDBM50066430
Substrate/Competitorn/a
Meas. Tech.TREK1 Assay
pH7.3±n/a
Temperature295.15±n/a K
EC50 4000±n/a nM
Commentsextracted
Citation Viswanath, ANJung, SYHwang, EMPark, KDLim, SMMin, SJCho, YSPae, AN Identification of the first in silico-designed TREK1 antagonists that block channel currents dose dependently. Chem Biol Drug Des88:807-819 (2016) 
 
Potassium channel subfamily K member 2
Name:Potassium channel subfamily K member 2
Type:Protein
Mol. Mass.:47099.16
Organism:Homo sapiens (Human)
Description:O95069
Residue:426
BDBM50066430
NameBDBM50066430
Synonyms:2-(4-Methyl-piperazin-1-yl)-5-(2,3,5-trichloro-phenyl)-pyrimidin-4-ylamine CHEMBL28854 | SIPATRIGINE
TypeSmall organic molecule
Emp. Form.C15H16Cl3N5
Mol. Mass.372.68
SMILESCN1CCN(CC1)c1ncc(c(N)n1)-c1cc(Cl)cc(Cl)c1Cl