Reaction Details
TargetPotassium channel subfamily K member 2
LigandBDBM81875
Substrate/Competitorn/a
Meas. Tech.TREK1 Assay
pH7.3±n/a
Temperature295.15±n/a K
EC50 19000±n/a nM
Commentsextracted
Citation Viswanath, ANJung, SYHwang, EMPark, KDLim, SMMin, SJCho, YSPae, AN Identification of the first in silico-designed TREK1 antagonists that block channel currents dose dependently. Chem Biol Drug Des88:807-819 (2016) 
 
Potassium channel subfamily K member 2
Name:Potassium channel subfamily K member 2
Type:Protein
Mol. Mass.:47099.16
Organism:Homo sapiens (Human)
Description:O95069
Residue:426
BDBM81875
NameBDBM81875
Synonyms:Fluoxetine-R-(-)
Typen/a
Emp. Form.C17H18F3NO
Mol. Mass.309.3261
SMILESCNCC[C@H](Oc1ccc(cc1)C(F)(F)F)c1ccccc1