Reaction Details
TargetPotassium channel subfamily K member 2
LigandBDBM202558
Substrate/Competitorn/a
Meas. Tech.TREK1 Assay
pH7.3±n/a
Temperature295.15±n/a K
IC50 4.7e+3± 2e+2 nM
Commentsextracted
Citation Viswanath, ANJung, SYHwang, EMPark, KDLim, SMMin, SJCho, YSPae, AN Identification of the first in silico-designed TREK1 antagonists that block channel currents dose dependently. Chem Biol Drug Des88:807-819 (2016) 
 
Potassium channel subfamily K member 2
Name:Potassium channel subfamily K member 2
Type:Protein
Mol. Mass.:47099.16
Organism:Homo sapiens (Human)
Description:O95069
Residue:426
BDBM202558
NameBDBM202558
Synonyms:NC30
TypeSmall organic molecule
Emp. Form.C24H28F3N3O2
Mol. Mass.447.4932
SMILESCC(C)Oc1ccc(CN2CCC(O)(Cn3c(cc4cccnc34)C(F)(F)F)CC2)cc1