Reaction Details
TargetNitric oxide synthase, brain
LigandBDBM152720
Substrate/Competitorn/a
Meas. Tech.Inhibition Assay
Ki 21.4±n/a nM
Citation Silverman, RBHuang, HJing, Q Thiophene-2-carboximidamide based selective neuronal nitric oxide inhibitors US Patent US9242957 Publication Date 1/26/2016
 
Nitric oxide synthase, brain
Name:Nitric oxide synthase, brain
Type:Enzyme
Mol. Mass.:160570.98
Organism:Rattus norvegicus (rat)
Description:Recombinant nNOS overexpressed in E. coli was used in enzyme assays.
Residue:1429
BDBM152720
NameBDBM152720
Synonyms:N-[3-({[(3S,5S)-5-({[3-(thiophene-2-imidamido)phenyl]methoxy}methyl)pyrrolidin-3-yl]oxy}methyl)phenyl]-2H-1λ⁴-thiophene-2-carboximidamide (25) | US9242957, QJ-II-199
TypeSmall organic molecule
Emp. Form.C29H31N5O2S2
Mol. Mass.545.719
SMILESN=C(Nc1cccc(COC[C@@H]2C[C@@H](CN2)OCc2cccc(NC(=N)c3cccs3)c2)c1)c1cccs1