Reaction Details
TargetNitric oxide synthase, endothelial
LigandBDBM202649
Substrate/Competitorn/a
Meas. Tech.Inhibition Assay
Ki 1450±n/a nM
Citation Silverman, RBHuang, HJing, Q Thiophene-2-carboximidamide based selective neuronal nitric oxide inhibitors US Patent US9242957 Publication Date 1/26/2016
 
Nitric oxide synthase, endothelial
Name:Nitric oxide synthase, endothelial
Type:Enzyme
Mol. Mass.:133292.26
Organism:Bos taurus (bovine)
Description:Recombinant eNOS overexpressed in E. coli was used in enzyme assays.
Residue:1205
BDBM202649
NameBDBM202649
Synonyms:US9242957, QJ-II-195
TypeSmall organic molecule
Emp. Form.C29H31N5O2S2
Mol. Mass.545.719
SMILESN=C(Nc1cccc(COCC2NCCC2OCc2cccc(NC(=N)c3cccs3)c2)c1)c1cccs1