Reaction Details
TargetNitric oxide synthase, inducible
LigandBDBM202651
Substrate/Competitorn/a
Meas. Tech.Inhibition Assay
Ki 1110±n/a nM
Citation Silverman, RBHuang, HJing, Q Thiophene-2-carboximidamide based selective neuronal nitric oxide inhibitors US Patent US9242957 Publication Date 1/26/2016
 
Nitric oxide synthase, inducible
Name:Nitric oxide synthase, inducible
Type:Enzyme
Mol. Mass.:130595.79
Organism:Mus musculus (mouse)
Description:Recombinant enzyme overexpressed in E. coli.
Residue:1144
BDBM202651
NameBDBM202651
Synonyms:US9242957, QJ-II-194
TypeSmall organic molecule
Emp. Form.C29H31N5O2S2
Mol. Mass.545.719
SMILESN=C(Nc1cccc(COC[C@H]2NCC[C@@H]2OCc2cccc(NC(=N)c3cccs3)c2)c1)c1cccs1