Reaction Details
TargetMitogen-activated protein kinase 14
LigandBDBM142598
Substrate/Competitorn/a
Meas. Tech.Enzyme Inhibition Assay
Temperature298.15±n/a K
IC50 12±0.0 nM
Commentsextracted
Citation Ito, KStrong, PRapeport, WGMurray, PJKing-Underwood, JWilliams, JGOnions, SCharron, CE P38MAP kinase inhibitors US Patent US9242960 Publication Date 1/26/2016
 
Mitogen-activated protein kinase 14
Name:Mitogen-activated protein kinase 14
Type:Serine/threonine-protein kinase
Mol. Mass.:41286.76
Organism:Homo sapiens (Human)
Description:Q16539
Residue:360
BDBM142598
NameBDBM142598
Synonyms:US10238658, Example Reference US8933228, Ref 2 US9249125, Reference Compound US9724347, Example Reference | US9993478, Example Reference
TypeSmall organic molecule
Emp. Form.C33H34N6O4
Mol. Mass.578.6609
SMILESCOCC(=O)Nc1cc(Oc2ccc(NC(=O)Nc3cc(nn3-c3ccc(C)cc3)C(C)(C)C)c3ccccc23)ccn1