Reaction Details
TargetRAF proto-oncogene serine/threonine-protein kinase [1-324]
LigandBDBM202656
Substrate/Competitorn/a
Meas. Tech.In Vitro Enzyme Assay
pH7.5±n/a
Temperature298.15±n/a K
IC50 0.144±n/a nM
Commentsextracted
Citation Barsanti, PABurger, MLou, YNishiguchi, GPolyakov, VRamurthy, SRico, ASetti, LSmith, ATaft, BTanner, HDiPesa, AYusuff, N Biaryl amide compounds as kinase inhibitors US Patent US9242969 Publication Date 1/26/2016
 
RAF proto-oncogene serine/threonine-protein kinase [1-324]
Name:RAF proto-oncogene serine/threonine-protein kinase [1-324]
Type:n/a
Mol. Mass.:36996.69
Organism:Homo sapiens (Human)
Description:P04049 (1-324)
Residue:324
BDBM202656
NameBDBM202656
Synonyms:US10245267, Example 1 US9242969, 1 | US9694016, 1
TypeSmall organic molecule
Emp. Form.C23H21F3N4O2
Mol. Mass.442.4336
SMILESCc1ccc(NC(=O)c2cccc(c2)C(F)(F)F)cc1-c1cc(ncn1)N1CCOCC1