Reaction Details
TargetRAF proto-oncogene serine/threonine-protein kinase [1-324]
LigandBDBM202662
Substrate/Competitorn/a
Meas. Tech.In Vitro Enzyme Assay
pH7.5±n/a
Temperature298.15±n/a K
IC50 1.114±n/a nM
Commentsextracted
Citation Barsanti, PABurger, MLou, YNishiguchi, GPolyakov, VRamurthy, SRico, ASetti, LSmith, ATaft, BTanner, HDiPesa, AYusuff, N Biaryl amide compounds as kinase inhibitors US Patent US9242969 Publication Date 1/26/2016
 
RAF proto-oncogene serine/threonine-protein kinase [1-324]
Name:RAF proto-oncogene serine/threonine-protein kinase [1-324]
Type:n/a
Mol. Mass.:36996.69
Organism:Homo sapiens (Human)
Description:P04049 (1-324)
Residue:324
BDBM202662
NameBDBM202662
Synonyms:US10245267, Example 7 US9242969, 7 | US9694016, 7
TypeSmall organic molecule
Emp. Form.C27H28F3N5O4S
Mol. Mass.575.603
SMILESCc1ccc(cc1-c1cc(nc(n1)N1CCOCC1)N1CCS(=O)(=O)CC1)C(=O)Nc1cccc(c1)C(F)(F)F