Reaction Details
TargetRAF proto-oncogene serine/threonine-protein kinase [1-324]
LigandBDBM202663
Substrate/Competitorn/a
Meas. Tech.In Vitro Enzyme Assay
pH7.5±n/a
Temperature298.15±n/a K
IC50 0.514±n/a nM
Commentsextracted
Citation Barsanti, PABurger, MLou, YNishiguchi, GPolyakov, VRamurthy, SRico, ASetti, LSmith, ATaft, BTanner, HDiPesa, AYusuff, N Biaryl amide compounds as kinase inhibitors US Patent US9242969 Publication Date 1/26/2016
 
RAF proto-oncogene serine/threonine-protein kinase [1-324]
Name:RAF proto-oncogene serine/threonine-protein kinase [1-324]
Type:n/a
Mol. Mass.:36996.69
Organism:Homo sapiens (Human)
Description:P04049 (1-324)
Residue:324
BDBM202663
NameBDBM202663
Synonyms:US10709712, Example 8 US9242969, 9 | US9694016, 8
TypeSmall organic molecule
Emp. Form.C27H28F3N5O4S
Mol. Mass.575.603
SMILESCc1ccc(NC(=O)c2cccc(c2)C(F)(F)F)cc1-c1cc(nc(n1)N1CCS(=O)(=O)CC1)N1CCOCC1