Reaction Details
TargetMitogen-activated protein kinase 1
LigandBDBM203319
Substrate/Competitorn/a
Meas. Tech.IMAP Assay
IC50 0.65±n/a nM
Citation Shipps, Jr., GWDeng, YCooper, ABGao, XSun, BWang, JZhu, L Fused pyrazole derivatives as novel ERK inhibitors US Patent US9242981 Publication Date 1/26/2016
 
Mitogen-activated protein kinase 1
Name:Mitogen-activated protein kinase 1
Type:Protein
Mol. Mass.:41278.65
Organism:Mus musculus (Mouse)
Description:P63085
Residue:358
BDBM203319
NameBDBM203319
Synonyms:US9242981, 48
TypeSmall organic molecule
Emp. Form.C24H27FN6O
Mol. Mass.434.5092
SMILESFc1ccccc1CN1CCC[C@H](C1)NC(=O)N1CCc2[nH]nc(c2C1)-c1ccncc1