Reaction Details
TargetMitogen-activated protein kinase 1
LigandBDBM203329
Substrate/Competitorn/a
Meas. Tech.IMAP Assay
IC50 0.3±n/a nM
Citation Shipps, Jr., GWDeng, YCooper, ABGao, XSun, BWang, JZhu, L Fused pyrazole derivatives as novel ERK inhibitors US Patent US9242981 Publication Date 1/26/2016
 
Mitogen-activated protein kinase 1
Name:Mitogen-activated protein kinase 1
Type:Protein
Mol. Mass.:41278.65
Organism:Mus musculus (Mouse)
Description:P63085
Residue:358
BDBM203329
NameBDBM203329
Synonyms:US9242981, 61
TypeSmall organic molecule
Emp. Form.C27H31N7O
Mol. Mass.469.5813
SMILESCn1c(CN2CCC[C@H](C2)NC(=O)N2CCc3[nH]nc(c3C2)-c2ccncc2)cc2ccccc12