Reaction Details
TargetMitogen-activated protein kinase 1
LigandBDBM203448
Substrate/Competitorn/a
Meas. Tech.IMAP Assay
IC50 1.9±n/a nM
Citation Shipps, Jr., GWDeng, YCooper, ABGao, XSun, BWang, JZhu, L Fused pyrazole derivatives as novel ERK inhibitors US Patent US9242981 Publication Date 1/26/2016
 
Mitogen-activated protein kinase 1
Name:Mitogen-activated protein kinase 1
Type:Protein
Mol. Mass.:41278.65
Organism:Mus musculus (Mouse)
Description:P63085
Residue:358
BDBM203448
NameBDBM203448
Synonyms:US9242981, 147
TypeSmall organic molecule
Emp. Form.C24H31N7O
Mol. Mass.433.5492
SMILESCCn1cc(cn1)-c1n[nH]c2CCN(Cc12)C(=O)NC1CN(C)CC1c1ccccc1C