Reaction Details
TargetSerine/threonine-protein kinase WNK1 [1-444]
LigandBDBM203827
Substrate/Competitorn/a
Meas. Tech.In vitro MBP Phosphorylation Assay (MBP)
pH7.3±n/a
Temperature298.15±n/a K
IC50 9±0.0 nM
Commentsextracted
Citation Yamada, KPark, HMRigel, DFDiPetrillo, KWhalen, EJAnisowicz, ABeil, MBerstler, JBrocklehurst, CEBurdick, DACaplan, SLCapparelli, MPChen, GChen, WDale, BDeng, LFu, FHamamatsu, NHarasaki, KHerr, THoffmann, PHu, QYHuang, WJIdamakanti, NImase, HIwaki, YJain, MJeyaseelan, JKato, MKaushik, VKKohls, DKunjathoor, VLaSala, DLee, JLiu, JLuo, YMa, FMo, RMowbray, SMogi, MOssola, FPandey, PPatel, SJRaghavan, SSalem, BShanado, YHTrakshel, GMTurner, GWakai, HWang, CWeldon, SWielicki, JBXie, XXu, LYagi, YIYasoshima, KYin, JYowe, DZhang, JHZheng, GMonovich, L Small-molecule WNK inhibition regulates cardiovascular and renal function. Nat Chem Biol12:896-898 (2016) 
 
Serine/threonine-protein kinase WNK1 [1-444]
Name:Serine/threonine-protein kinase WNK1 [1-444]
Type:n/a
Mol. Mass.:48305.17
Organism:Homo sapiens (Human)
Description:Q9H4A3 1-444 aa Carna Biosciences, cat no. 05-182
Residue:444
BDBM203827
NameBDBM203827
Synonyms:N-(tert-butyl)-1-(1-(5-(5-(trifluoromethyl)-1,3,4-oxadiazol- 2-yl)pyridin-2-yl)piperidin-4-yl)-1H-imidazole-5-carboxamide WNK463 (2)
TypeSmall organic molecule
Emp. Form.C22H25F3N6O2
Mol. Mass.462.4681
SMILESCC(C)(C)NC(=O)c1cncn1C1CCN(CC1)c1ccc(cc1)-c1nnc(o1)C(F)(F)F