Reaction Details
TargetKallikrein-7 [37-253,Y180R]
LigandBDBM203865
Substrate/Competitorn/a
Meas. Tech.Human KLK7 Fluorescence-Lifetime Assay
pH5.6±n/a
Temperature298.15±n/a K
IC50 8.7e+3± 4.6e+3 nM
Commentsextracted
Citation Maibaum, JLiao, SMVulpetti, AOstermann, NRandl, SRüdisser, SLorthiois, EErbel, PKinzel, BKolb, FABarbieri, SWagner, JDurand, CFettis, KDussauge, SHughes, NDelgado, OHommel, UGould, TMac Sweeney, AGerhartz, BCumin, FFlohr, SSchubart, AJaffee, BHarrison, RRisitano, AMEder, JAnderson, K Small-molecule factor D inhibitors targeting the alternative complement pathway. Nat Chem Biol12:1105-1110 (2016) 
 
Kallikrein-7 [37-253,Y180R]
Name:Kallikrein-7 [37-253,Y180R]
Type:Protein
Mol. Mass.:23785.70
Organism:Homo sapiens (Human)
Description:P49862 (37-253 aa with Y180R mutation)
Residue:217
BDBM203865
NameBDBM203865
Synonyms:Methyl (S)-2-((2-((3-(trifluoromethoxy)phenyl)carbamoyl)pyrrolidine-1-carboxamido)-methyl)benzoate (2)
TypeSmall organic molecule
Emp. Form.C22H22F3N3O5
Mol. Mass.465.4224
SMILESCOC(=O)c1ccccc1CNC(=O)N1CCC[C@H]1C(=O)Nc1cccc(OC(F)(F)F)c1