Reaction Details
TargetMitogen-activated protein kinase 1
LigandBDBM204316
Substrate/Competitorn/a
Meas. Tech.ERK2 (20 pM) Kinase Assay
pH7.5±n/a
IC50 0.00827±n/a nM
Commentsextracted
Citation Bagdanoff, JTDing, YHan, WHuang, ZJiang, QJin, JXKou, XLee, PLindvall, MMin, ZPan, YPecchi, SPfister, KBPoon, DRauniyar, VWang, XMZhang, QZhou, JZhu, S Aminoheteroaryl benzamides as kinase inhibitors US Patent US9242996 Publication Date 1/26/2016
 
Mitogen-activated protein kinase 1
Name:Mitogen-activated protein kinase 1
Type:Ser/Thr Protein Kinase
Mol. Mass.:41392.76
Organism:Homo sapiens (Human)
Description:P28482
Residue:360
BDBM204316
NameBDBM204316
Synonyms:US9242996, 395
TypeSmall organic molecule
Emp. Form.C25H26F2N4O3S
Mol. Mass.500.561
SMILESCSc1cc(F)cc(c1)[C@@H](CO)NC(=O)c1ccc(cc1F)-c1nc(cnc1N)C1CCOCC1