Reaction Details
TargetBcl-2-like protein 1 [1-209]
LigandBDBM204937
Substrate/Competitorn/a
Meas. Tech.Fluorescence Polarization Assay
pH7.5±n/a
IC50 0.5±n/a nM
Commentsextracted
Citation Diebold, RBGero, TWGrover, PHuang, SIoannidis, SOgoe, CASaeh, JC Chemical compounds US Patent US9248140 Publication Date 2/2/2016
 
Bcl-2-like protein 1 [1-209]
Name:Bcl-2-like protein 1 [1-209]
Type:Protein
Mol. Mass.:23354.38
Organism:Homo sapiens (Human)
Description:C-terminal 6XHIS tagged Bcl-XL (aa 1-209)
Residue:209
BDBM204937
NameBDBM204937
Synonyms:US9248140, 21
TypeSmall organic molecule
Emp. Form.C49H55ClF3N5O7S3
Mol. Mass.1014.634
SMILESCCNC[C@@H]1COCCN1CC[C@H](CSc1ccccc1)Nc1ccc(cc1S(=O)(=O)C(F)(F)F)S(=O)(=O)NC(=O)c1ccc(cc1)N1CCC(CC1)[C@@H](O)c1ccccc1-c1ccc(Cl)cc1