Reaction Details
TargetMitogen-activated protein kinase 14
LigandBDBM205298
Substrate/Competitorn/a
Meas. Tech.p38 MAPKα Enzyme Inhibition Assay
IC50 2±n/a nM
Citation Duffy, LAKing-Underwood, JLongshaw, AIMurray, PJOnions, STTaddei, DMWilliams, JGIto, KCharron, CE Pyrazole derivatives as p38 MAP inhibitors US Patent US9249125 Publication Date 2/2/2016
 
Mitogen-activated protein kinase 14
Name:Mitogen-activated protein kinase 14
Type:Serine/threonine-protein kinase
Mol. Mass.:41286.76
Organism:Homo sapiens (Human)
Description:Q16539
Residue:360
BDBM205298
NameBDBM205298
Synonyms:US9249125, 51
TypeSmall organic molecule
Emp. Form.C41H41N9O4
Mol. Mass.723.8221
SMILESCC(C)c1cc(NC(=O)Nc2ccc(Oc3ccnc(Nc4ccc5[nH]ncc5c4)c3)c3ccccc23)n(n1)-c1cccc(OCCN2CCOCC2)c1