Reaction Details
TargetMitogen-activated protein kinase 14
LigandBDBM205305
Substrate/Competitorn/a
Meas. Tech.p38 MAPKα Enzyme Inhibition Assay
IC50<1±n/a nM
Citation Duffy, LAKing-Underwood, JLongshaw, AIMurray, PJOnions, STTaddei, DMWilliams, JGIto, KCharron, CE Pyrazole derivatives as p38 MAP inhibitors US Patent US9249125 Publication Date 2/2/2016
 
Mitogen-activated protein kinase 14
Name:Mitogen-activated protein kinase 14
Type:Serine/threonine-protein kinase
Mol. Mass.:41286.76
Organism:Homo sapiens (Human)
Description:Q16539
Residue:360
BDBM205305
NameBDBM205305
Synonyms:US9249125, 58
TypeSmall organic molecule
Emp. Form.C41H43N9O3
Mol. Mass.709.8386
SMILESCN(C)CCOc1ccc(cc1)-n1nc(cc1NC(=O)Nc1ccc(Oc2ccnc(Nc3cc(C)c4[nH]ncc4c3)c2)c2ccccc12)C(C)(C)C