Reaction Details
TargetMitogen-activated protein kinase 14
LigandBDBM205319
Substrate/Competitorn/a
Meas. Tech.p38 MAPKα Enzyme Inhibition Assay
IC50 13±n/a nM
Citation Duffy, LAKing-Underwood, JLongshaw, AIMurray, PJOnions, STTaddei, DMWilliams, JGIto, KCharron, CE Pyrazole derivatives as p38 MAP inhibitors US Patent US9249125 Publication Date 2/2/2016
 
Mitogen-activated protein kinase 14
Name:Mitogen-activated protein kinase 14
Type:Serine/threonine-protein kinase
Mol. Mass.:41286.76
Organism:Homo sapiens (Human)
Description:Q16539
Residue:360
BDBM205319
NameBDBM205319
Synonyms:US9249125, 72
TypeSmall organic molecule
Emp. Form.C42H44N10O4
Mol. Mass.752.8634
SMILESCc1n[nH]c2ccc(Nc3nccc(Oc4ccc(NC(=O)Nc5cc(nn5-c5ccc(OCCN6CCOCC6)cc5)C(C)(C)C)c5ccccc45)n3)cc12