Reaction Details
TargetTyrosine-protein kinase SYK
LigandBDBM205257
Substrate/Competitorn/a
Meas. Tech.c-Src and Syk Enzyme Inhibition Assay
IC50 2±n/a nM
Citation Duffy, LAKing-Underwood, JLongshaw, AIMurray, PJOnions, STTaddei, DMWilliams, JGIto, KCharron, CE Pyrazole derivatives as p38 MAP inhibitors US Patent US9249125 Publication Date 2/2/2016
 
Tyrosine-protein kinase SYK
Name:Tyrosine-protein kinase SYK
Type:Enzyme
Mol. Mass.:72079.99
Organism:Homo sapiens (Human)
Description:P43405
Residue:635
BDBM205257
NameBDBM205257
Synonyms:US9249125, 10
TypeSmall organic molecule
Emp. Form.C41H40N10O3
Mol. Mass.720.8215
SMILESCc1cc(Nc2nccc(Oc3ccc(NC(=O)Nc4cc(nn4-c4cccc(CN5CCCC5=O)c4)C(C)(C)C)c4ccccc34)n2)cc2cn[nH]c12