Reaction Details
TargetTyrosine-protein kinase SYK
LigandBDBM205291
Substrate/Competitorn/a
Meas. Tech.c-Src and Syk Enzyme Inhibition Assay
IC50 2±n/a nM
Citation Duffy, LAKing-Underwood, JLongshaw, AIMurray, PJOnions, STTaddei, DMWilliams, JGIto, KCharron, CE Pyrazole derivatives as p38 MAP inhibitors US Patent US9249125 Publication Date 2/2/2016
 
Tyrosine-protein kinase SYK
Name:Tyrosine-protein kinase SYK
Type:Enzyme
Mol. Mass.:72079.99
Organism:Homo sapiens (Human)
Description:P43405
Residue:635
BDBM205291
NameBDBM205291
Synonyms:US9249125, 44
TypeSmall organic molecule
Emp. Form.C41H42N10O5
Mol. Mass.754.8362
SMILESCOc1ccc(cc1)-n1nc(cc1NC(=O)Nc1ccc(Oc2ccnc(Nc3ccc4[nH]nc(OCCN5CCOCC5)c4c3)n2)c2ccccc12)C(C)C